Target
Melanin-concentrating hormone receptor 1
Ligand
BDBM50107822
Substrate
Meas. Tech.
ChEMBL_1509301 (CHEMBL3603114)
IC50
15±n/a nM
Citation
 Müller, SGHeckel, AKley, JTLehmann, TLustenberger, POost, TRoth, GJRudolf, KArndt, KLenter, MLotz, RRMaier, GMMarkert, MSchindler, MStenkamp, D Design, synthesis and evaluation of MCH receptor 1 antagonists--Part I: Optimization of HTS hits towards an in vivo efficacious tool compound BI 414. Bioorg Med Chem Lett 25:3264-9 (2015)  
Target
Name:
Melanin-concentrating hormone receptor 1
Synonyms:
G-protein coupled receptor 24 MCH receptor 1 MCH-R1 MCHR-1 MCHR1_HUMAN Melanin-Concentrating Hormone Receptor 1 (MCH1R) Melanin-concentrating hormone receptor 1 (MCH-1) Melanin-concentrating hormone receptor 1 (MCHR-1) SLC-1 Somatostatin receptor-like protein
Type:
G Protein-Coupled Receptor (GPCR)
Mol. Mass.:
45976.27
Organism:
Homo sapiens (Human)
Description:
Membranes from CHO-K1 cells stably expressing human MCH1R were used in assays.
Residue:
422
  
Inhibitor
Name:
BDBM50107822
Synonyms:
CHEMBL3600819
Type:
Small organic molecule
Emp. Form.:
C27H32N2O3
Mol. Mass.:
432.5546
SMILES:
CCN(CC)CCOc1ccc(cc1)N(C)C(=O)c1ccc(cc1)-c1ccc(OC)cc1
: