Target
E3 ubiquitin-protein ligase Mdm2
Ligand
BDBM162123
Substrate
Meas. Tech.
ChEMBL_1509562 (CHEMBL3602309)
Ki
66±n/a nM
Citation
 Holzer, PMasuya, KFuret, PKallen, JValat-Stachyra, TFerretti, SBerghausen, JBouisset-Leonard, MBuschmann, NPissot-Soldermann, CRynn, CRuetz, SStutz, SChène, PJeay, SGessier, F Discovery of a Dihydroisoquinolinone Derivative (NVP-CGM097): A Highly Potent and Selective MDM2 Inhibitor Undergoing Phase 1 Clinical Trials in p53wt Tumors. J Med Chem 58:6348-58 (2015)  
Target
Name:
E3 ubiquitin-protein ligase Mdm2
Synonyms:
6.3.2.- E3 ubiquitin-protein ligase Mdm2 Mdm2 p53-binding protein Mdm2
Type:
PROTEIN
Mol. Mass.:
54524.71
Organism:
Mus musculus
Description:
ChEMBL_109855
Residue:
489
  
Inhibitor
Name:
BDBM162123
Synonyms:
US9051279, 106
Type:
Small organic molecule
Emp. Form.:
C38H47ClN4O4
Mol. Mass.:
659.257
SMILES:
COc1cc2CC(=O)N([C@@H](c3ccc(Cl)cc3)c2cc1OC(C)C)c1ccc(cc1)N(C)C[C@H]1CC[C@@H](CC1)N1CCN(C)C(=O)C1
: