Target
Serine/threonine-protein kinase mTOR
Ligand
BDBM50108117
Substrate
Meas. Tech.
ChEMBL_1508409 (CHEMBL3602347)
IC50
123±n/a nM
Citation
 Wang, XMMao, SCao, LXie, XXXin, MHLian, JFCao, YXZhang, SQ Modification of N-(6-(2-methoxy-3-(4-fluorophenylsulfonamido)pyridin-5-yl)-[1,2,4]triazolo[1,5-a]pyridin-2-yl)acetamide as PI3Ks inhibitor by replacement of the acetamide group with alkylurea. Bioorg Med Chem 23:5662-71 (2015)  
Target
Name:
Serine/threonine-protein kinase mTOR
Synonyms:
FK506-binding protein 12-rapamycin complex-associated protein 1 FRAP FRAP1 MTOR Mammalian Target of Rapamycin (mTOR) RAFT1 Rapamycin and FKBP12 target 1 Serine/threonine-protein kinase (mTOR) | mTORC2
Type:
Rapamycin target protein
Mol. Mass.:
288917.12
Organism:
Homo sapiens (Human)
Description:
P42345
Residue:
2549
  
Inhibitor
Name:
BDBM50108117
Synonyms:
CHEMBL3601925
Type:
Small organic molecule
Emp. Form.:
C25H29FN8O4S
Mol. Mass.:
556.612
SMILES:
CCN(CC)CCNC(=O)Nc1nc2ccc(cn2n1)-c1cnc(OC)c(NS(=O)(=O)c2ccc(F)cc2)c1
: