Target
Gamma-aminobutyric acid type B receptor subunit 1/2
Ligand
BDBM50007118
Substrate
Meas. Tech.
ChEMBL_1508360 (CHEMBL3602208)
IC50
610±n/a nM
Citation
 Brown, KMRoy, KKHockerman, GHDoerksen, RJColby, DA Activation of theż-Aminobutyric Acid Type B (GABA(B)) Receptor by Agonists and Positive Allosteric Modulators. J Med Chem 58:6336-47 (2015)  
Target
Name:
Gamma-aminobutyric acid type B receptor subunit 1/2
Synonyms:
GABA-B receptor | GABA-B receptor 1/2
Type:
Mol. Mass.:
Description:
ASSAY_ID of EBI is 68423
Components:
This complex has 2 components.
Component 1
Name:
Gamma-aminobutyric acid type B receptor subunit 1
Synonyms:
GABA-B receptor GABA-B-R1 GABBR1 GARABR1 Gb1
Type:
Enzyme Catalytic Domain
Mol. Mass.:
108337.22
Organism:
Homo sapiens (Human)
Description:
Q9UBS5
Residue:
961
  
Component 2
Name:
Gamma-aminobutyric acid type B receptor subunit 2
Synonyms:
GABA-B receptor GABR2_HUMAN GPRC3B
Type:
PROTEIN
Mol. Mass.:
105844.45
Organism:
Homo sapiens (Human)
Description:
EBI_100031
Residue:
941
  
Inhibitor
Name:
BDBM50007118
Synonyms:
4-Amino-3-(5-chloro-thiophen-2-yl)-butyric acid | CHEMBL87482
Type:
Small organic molecule
Emp. Form.:
C8H10ClNO2S
Mol. Mass.:
219.688
SMILES:
NCC(CC(O)=O)c1ccc(Cl)s1
: