Target
Baculoviral IAP repeat-containing protein 2
Ligand
BDBM155969
Substrate
Meas. Tech.
ChEMBL_1508698 (CHEMBL3602896)
IC50
3700±n/a nM
Citation
 Chessari, GBuck, IMDay, JEDay, PJIqbal, AJohnson, CNLewis, EJMartins, VMiller, DReader, MRees, DCRich, SJTamanini, EVitorino, MWard, GAWilliams, PAWilliams, GWilsher, NEWoolford, AJ Fragment-Based Drug Discovery Targeting Inhibitor of Apoptosis Proteins: Discovery of a Non-Alanine Lead Series with Dual Activity Against cIAP1 and XIAP. J Med Chem 58:6574-88 (2015)  
Target
Name:
Baculoviral IAP repeat-containing protein 2
Synonyms:
API1 BIRC2_HUMAN Cellular inhibitor of apoptosis 1 MIHB | RNF48
Type:
Protein
Mol. Mass.:
69900.47
Organism:
Homo sapiens (Human)
Description:
Q13490
Residue:
618
  
Inhibitor
Name:
BDBM155969
Synonyms:
US9018214, 20
Type:
Small organic molecule
Emp. Form.:
C17H24ClN3O
Mol. Mass.:
321.845
SMILES:
C[C@@H]1CN(CC(=O)N2CC(C)(C)c3ccc(Cl)cc23)CCN1
: