Target
E3 ubiquitin-protein ligase XIAP
Ligand
BDBM155969
Substrate
Meas. Tech.
ChEMBL_1508678 (CHEMBL3602876)
IC50
5500±n/a nM
Citation
 Chessari, GBuck, IMDay, JEDay, PJIqbal, AJohnson, CNLewis, EJMartins, VMiller, DReader, MRees, DCRich, SJTamanini, EVitorino, MWard, GAWilliams, PAWilliams, GWilsher, NEWoolford, AJ Fragment-Based Drug Discovery Targeting Inhibitor of Apoptosis Proteins: Discovery of a Non-Alanine Lead Series with Dual Activity Against cIAP1 and XIAP. J Med Chem 58:6574-88 (2015)  
Target
Name:
E3 ubiquitin-protein ligase XIAP
Synonyms:
API3 E3 ubiquitin-protein ligase XIAP Inhibitor of apoptosis protein 3 X-linked inhibitor of apoptosis XIAP | XIAP_HUMAN
Type:
Protein
Mol. Mass.:
56685.27
Organism:
Homo sapiens (Human)
Description:
P98170
Residue:
497
  
Inhibitor
Name:
BDBM155969
Synonyms:
US9018214, 20
Type:
Small organic molecule
Emp. Form.:
C17H24ClN3O
Mol. Mass.:
321.845
SMILES:
C[C@@H]1CN(CC(=O)N2CC(C)(C)c3ccc(Cl)cc23)CCN1
: