Target
E3 ubiquitin-protein ligase XIAP
Ligand
BDBM156012
Substrate
Meas. Tech.
ChEMBL_1508678 (CHEMBL3602876)
IC50
160±n/a nM
Citation
 Chessari, GBuck, IMDay, JEDay, PJIqbal, AJohnson, CNLewis, EJMartins, VMiller, DReader, MRees, DCRich, SJTamanini, EVitorino, MWard, GAWilliams, PAWilliams, GWilsher, NEWoolford, AJ Fragment-Based Drug Discovery Targeting Inhibitor of Apoptosis Proteins: Discovery of a Non-Alanine Lead Series with Dual Activity Against cIAP1 and XIAP. J Med Chem 58:6574-88 (2015)  
Target
Name:
E3 ubiquitin-protein ligase XIAP
Synonyms:
API3 E3 ubiquitin-protein ligase XIAP Inhibitor of apoptosis protein 3 X-linked inhibitor of apoptosis XIAP | XIAP_HUMAN
Type:
Protein
Mol. Mass.:
56685.27
Organism:
Homo sapiens (Human)
Description:
P98170
Residue:
497
  
Inhibitor
Name:
BDBM156012
Synonyms:
US9018214, 63
Type:
Small organic molecule
Emp. Form.:
C25H34N4O2
Mol. Mass.:
422.5631
SMILES:
COC[C@H]1CN[C@H](C)CN1CC(=O)N1CC(C)(C)c2cnc(Cc3ccccc3)cc12
: