Target
Carbonic anhydrase 1
Ligand
BDBM50109154
Substrate
Meas. Tech.
ChEMBL_1508923 (CHEMBL3602142)
Ki
70±n/a nM
Citation
 Congiu, COnnis, VDeplano, ABalboni, GCeruso, MSupuran, CT Synthesis and carbonic anhydrase I, II, IX and XII inhibitory activity of sulfamates incorporating piperazinyl-ureido moieties. Bioorg Med Chem 23:5619-25 (2015)  
Target
Name:
Carbonic anhydrase 1
Synonyms:
CA-I CAB Carbonate dehydratase I Carbonic anhydrase 1 (CA I) Carbonic anhydrase 1 (Recombinant CA I) Carbonic anhydrase B Carbonic anhydrase I (CA I) Carbonic anhydrase I (CAI) Carbonic anhydrase isoenzyme I (hCA I) | hCA
Type:
Enzyme
Mol. Mass.:
28873.37
Organism:
Homo sapiens (Human)
Description:
P00915
Residue:
261
  
Inhibitor
Name:
BDBM50109154
Synonyms:
CHEMBL3601540
Type:
Small organic molecule
Emp. Form.:
C23H22N6O5S
Mol. Mass.:
494.523
SMILES:
NS(=O)(=O)Oc1ccc(NC(=O)N2CCN(CC2)c2nccc(n2)-c2cc3ccccc3o2)cc1
: