Target
Carbonic anhydrase 1
Ligand
BDBM50109269
Substrate
Meas. Tech.
ChEMBL_1508923 (CHEMBL3602142)
Ki
88±n/a nM
Citation
 Congiu, COnnis, VDeplano, ABalboni, GCeruso, MSupuran, CT Synthesis and carbonic anhydrase I, II, IX and XII inhibitory activity of sulfamates incorporating piperazinyl-ureido moieties. Bioorg Med Chem 23:5619-25 (2015)  
Target
Name:
Carbonic anhydrase 1
Synonyms:
CA-I CAB Carbonate dehydratase I Carbonic anhydrase 1 (CA I) Carbonic anhydrase 1 (Recombinant CA I) Carbonic anhydrase B Carbonic anhydrase I (CA I) Carbonic anhydrase I (CAI) Carbonic anhydrase isoenzyme I (hCA I) | hCA
Type:
Enzyme
Mol. Mass.:
28873.37
Organism:
Homo sapiens (Human)
Description:
P00915
Residue:
261
  
Inhibitor
Name:
BDBM50109269
Synonyms:
CHEMBL3601536
Type:
Small organic molecule
Emp. Form.:
C18H22N4O5S
Mol. Mass.:
406.456
SMILES:
COc1cccc(c1)N1CCN(CC1)C(=O)Nc1ccc(OS(N)(=O)=O)cc1
: