Target
Carbonic anhydrase 2
Ligand
BDBM50109268
Substrate
Meas. Tech.
ChEMBL_1508924 (CHEMBL3602143)
Ki
9.1±n/a nM
Citation
 Congiu, COnnis, VDeplano, ABalboni, GCeruso, MSupuran, CT Synthesis and carbonic anhydrase I, II, IX and XII inhibitory activity of sulfamates incorporating piperazinyl-ureido moieties. Bioorg Med Chem 23:5619-25 (2015)  
Target
Name:
Carbonic anhydrase 2
Synonyms:
CA-II CAC Carbonate dehydratase II Carbonic anhydrase 2 (CA-II) Carbonic anhydrase C Carbonic anhydrase II (CA-II) Carbonic anhydrase II (hCA II) | Carbonic anhydrase isoenzyme II (hCA II)
Type:
Enzyme
Mol. Mass.:
29250.71
Organism:
Homo sapiens (Human)
Description:
P00918
Residue:
260
  
Inhibitor
Name:
BDBM50109268
Synonyms:
CHEMBL3601537
Type:
Small organic molecule
Emp. Form.:
C18H22N4O5S
Mol. Mass.:
406.456
SMILES:
COc1ccc(cc1)N1CCN(CC1)C(=O)Nc1ccc(OS(N)(=O)=O)cc1
: