Target
Carbonic anhydrase 2
Ligand
BDBM50109270
Substrate
Meas. Tech.
ChEMBL_1508924 (CHEMBL3602143)
Ki
11±n/a nM
Citation
 Congiu, COnnis, VDeplano, ABalboni, GCeruso, MSupuran, CT Synthesis and carbonic anhydrase I, II, IX and XII inhibitory activity of sulfamates incorporating piperazinyl-ureido moieties. Bioorg Med Chem 23:5619-25 (2015)  
Target
Name:
Carbonic anhydrase 2
Synonyms:
CA-II CAC Carbonate dehydratase II Carbonic anhydrase 2 (CA-II) Carbonic anhydrase C Carbonic anhydrase II (CA-II) Carbonic anhydrase II (hCA II) | Carbonic anhydrase isoenzyme II (hCA II)
Type:
Enzyme
Mol. Mass.:
29250.71
Organism:
Homo sapiens (Human)
Description:
P00918
Residue:
260
  
Inhibitor
Name:
BDBM50109270
Synonyms:
CHEMBL3601535
Type:
Small organic molecule
Emp. Form.:
C19H24N4O4S
Mol. Mass.:
404.483
SMILES:
Cc1cccc(N2CCN(CC2)C(=O)Nc2ccc(OS(N)(=O)=O)cc2)c1C
: