Target
Carbonic anhydrase 2
Ligand
BDBM50109272
Substrate
Meas. Tech.
ChEMBL_1508924 (CHEMBL3602143)
Ki
17±n/a nM
Citation
 Congiu, COnnis, VDeplano, ABalboni, GCeruso, MSupuran, CT Synthesis and carbonic anhydrase I, II, IX and XII inhibitory activity of sulfamates incorporating piperazinyl-ureido moieties. Bioorg Med Chem 23:5619-25 (2015)  
Target
Name:
Carbonic anhydrase 2
Synonyms:
CA-II CAC Carbonate dehydratase II Carbonic anhydrase 2 (CA-II) Carbonic anhydrase C Carbonic anhydrase II (CA-II) Carbonic anhydrase II (hCA II) | Carbonic anhydrase isoenzyme II (hCA II)
Type:
Enzyme
Mol. Mass.:
29250.71
Organism:
Homo sapiens (Human)
Description:
P00918
Residue:
260
  
Inhibitor
Name:
BDBM50109272
Synonyms:
CHEMBL3601533
Type:
Small organic molecule
Emp. Form.:
C17H19ClN4O4S
Mol. Mass.:
410.875
SMILES:
NS(=O)(=O)Oc1ccc(NC(=O)N2CCN(CC2)c2ccc(Cl)cc2)cc1
: