Target
Carbonic anhydrase 9
Ligand
BDBM50109148
Substrate
Meas. Tech.
ChEMBL_1508925 (CHEMBL3602144)
Ki
11±n/a nM
Citation
 Congiu, COnnis, VDeplano, ABalboni, GCeruso, MSupuran, CT Synthesis and carbonic anhydrase I, II, IX and XII inhibitory activity of sulfamates incorporating piperazinyl-ureido moieties. Bioorg Med Chem 23:5619-25 (2015)  
Target
Name:
Carbonic anhydrase 9
Synonyms:
CA-IX CAH9_HUMAN Carbonic anhydrase 9 (CA IX) Carbonic anhydrase 9 precursor Carbonic anhydrase IX (CAIX) Carbonic anhydrases; II & IX MN RCC-associated antigen G250
Type:
Enzyme
Mol. Mass.:
49669.03
Organism:
Homo sapiens (Human)
Description:
Catalytic domain of human cloned isozyme was used in the assay
Residue:
459
  
Inhibitor
Name:
BDBM50109148
Synonyms:
CHEMBL3601530
Type:
Small organic molecule
Emp. Form.:
C18H22N4O4S
Mol. Mass.:
390.457
SMILES:
NS(=O)(=O)Oc1ccc(NC(=O)N2CCN(Cc3ccccc3)CC2)cc1
: