Target
Carbonic anhydrase 9
Ligand
BDBM50109146
Substrate
Meas. Tech.
ChEMBL_1508925 (CHEMBL3602144)
Ki
62±n/a nM
Citation
 Congiu, COnnis, VDeplano, ABalboni, GCeruso, MSupuran, CT Synthesis and carbonic anhydrase I, II, IX and XII inhibitory activity of sulfamates incorporating piperazinyl-ureido moieties. Bioorg Med Chem 23:5619-25 (2015)  
Target
Name:
Carbonic anhydrase 9
Synonyms:
CA-IX CAH9_HUMAN Carbonic anhydrase 9 (CA IX) Carbonic anhydrase 9 precursor Carbonic anhydrase IX (CAIX) Carbonic anhydrases; II & IX MN RCC-associated antigen G250
Type:
Enzyme
Mol. Mass.:
49669.03
Organism:
Homo sapiens (Human)
Description:
Catalytic domain of human cloned isozyme was used in the assay
Residue:
459
  
Inhibitor
Name:
BDBM50109146
Synonyms:
CHEMBL3601532
Type:
Small organic molecule
Emp. Form.:
C17H19FN4O4S
Mol. Mass.:
394.421
SMILES:
NS(=O)(=O)Oc1ccc(NC(=O)N2CCN(CC2)c2ccc(F)cc2)cc1
: