Target
Carbonic anhydrase 9
Ligand
BDBM50109270
Substrate
Meas. Tech.
ChEMBL_1508925 (CHEMBL3602144)
Ki
32±n/a nM
Citation
 Congiu, COnnis, VDeplano, ABalboni, GCeruso, MSupuran, CT Synthesis and carbonic anhydrase I, II, IX and XII inhibitory activity of sulfamates incorporating piperazinyl-ureido moieties. Bioorg Med Chem 23:5619-25 (2015)  
Target
Name:
Carbonic anhydrase 9
Synonyms:
CA-IX CAH9_HUMAN Carbonic anhydrase 9 (CA IX) Carbonic anhydrase 9 precursor Carbonic anhydrase IX (CAIX) Carbonic anhydrases; II & IX MN RCC-associated antigen G250
Type:
Enzyme
Mol. Mass.:
49669.03
Organism:
Homo sapiens (Human)
Description:
Catalytic domain of human cloned isozyme was used in the assay
Residue:
459
  
Inhibitor
Name:
BDBM50109270
Synonyms:
CHEMBL3601535
Type:
Small organic molecule
Emp. Form.:
C19H24N4O4S
Mol. Mass.:
404.483
SMILES:
Cc1cccc(N2CCN(CC2)C(=O)Nc2ccc(OS(N)(=O)=O)cc2)c1C
: