Target
Carbonic anhydrase 12
Ligand
BDBM50109272
Substrate
Meas. Tech.
ChEMBL_1508926 (CHEMBL3602145)
Ki
85±n/a nM
Citation
 Congiu, COnnis, VDeplano, ABalboni, GCeruso, MSupuran, CT Synthesis and carbonic anhydrase I, II, IX and XII inhibitory activity of sulfamates incorporating piperazinyl-ureido moieties. Bioorg Med Chem 23:5619-25 (2015)  
Target
Name:
Carbonic anhydrase 12
Synonyms:
CA-XII CAH12_HUMAN Carbonic anhydrase Carbonic anhydrase XII Carbonic anhydrase XII (CAXII) | Tumor antigen HOM-RCC-3.1.3
Type:
Enzyme
Mol. Mass.:
39456.00
Organism:
Homo sapiens (Human)
Description:
Catalytic domain of human cloned isozyme was used in the assay
Residue:
354
  
Inhibitor
Name:
BDBM50109272
Synonyms:
CHEMBL3601533
Type:
Small organic molecule
Emp. Form.:
C17H19ClN4O4S
Mol. Mass.:
410.875
SMILES:
NS(=O)(=O)Oc1ccc(NC(=O)N2CCN(CC2)c2ccc(Cl)cc2)cc1
: