Target
Amine oxidase [flavin-containing] B
Ligand
BDBM50430726
Substrate
Meas. Tech.
ChEMBL_1509992 (CHEMBL3608045)
Ki
0.129000±n/a nM
Citation
 Carradori, SSilvestri, R New Frontiers in Selective Human MAO-B Inhibitors. J Med Chem 58:6717-32 (2015)  
Target
Name:
Amine oxidase [flavin-containing] B
Synonyms:
AOFB_HUMAN MAOB Monoamine oxidase type B (MAO B) Monoamine oxidase type B (MAOB)
Type:
Protein
Mol. Mass.:
58768.76
Organism:
Homo sapiens (Human)
Description:
P27338
Residue:
520
  
Inhibitor
Name:
BDBM50430726
Synonyms:
CHEMBL2333930
Type:
Small organic molecule
Emp. Form.:
C34H44ClN3O
Mol. Mass.:
546.186
SMILES:
C[C@H](Cc1ccc(OCCCCCCCCNc2c3CCCCc3nc3cc(Cl)ccc23)cc1)N(C)CC#C
: