Target
Proto-oncogene tyrosine-protein kinase Src
Ligand
BDBM50111470
Substrate
Meas. Tech.
ChEMBL_1510119 (CHEMBL3606409)
IC50
65±n/a nM
Citation
 Engel, JRichters, AGetlik, MTomassi, SKeul, MTermathe, MLategahn, JBecker, CMayer-Wrangowski, SGrütter, CUhlenbrock, NKrüll, JSchaumann, NEppmann, SKibies, PHoffgaard, FHeil, JMenninger, SOrtiz-Cuaran, SHeuckmann, JMTinnefeld, VZahedi, RPSos, MLSchultz-Fademrecht, CThomas, RKKast, SMRauh, D Targeting Drug Resistance in EGFR with Covalent Inhibitors: A Structure-Based Design Approach. J Med Chem 58:6844-63 (2015)  
Target
Name:
Proto-oncogene tyrosine-protein kinase Src
Synonyms:
Calmodulin/Proto-oncogene tyrosine-protein kinase Src Proto-oncogene c-Src SRC SRC_HUMAN V-src sarcoma (Schmidt-Ruppin A-2) viral oncogene homolog (avian) p60-Src | pp60c-src
Type:
Protein
Mol. Mass.:
59838.60
Organism:
Homo sapiens (Human)
Description:
P12931
Residue:
536
  
Inhibitor
Name:
BDBM50111470
Synonyms:
CHEMBL1232944
Type:
Small organic molecule
Emp. Form.:
C20H16N6O
Mol. Mass.:
356.3806
SMILES:
C=CC(=O)Nc1ccc2c(Nc3cc[nH]n3)nc(nc2c1)-c1ccccc1
: