Target
Amiloride-sensitive sodium channel subunit alpha
Ligand
BDBM50112171
Substrate
Meas. Tech.
ChEMBL_1512947 (CHEMBL3609986)
IC50
9.0±n/a nM
Citation
 Blass, B Novel Pyrazine Amide Compounds. ACS Med Chem Lett 6:729-31 (2015)  
Target
Name:
Amiloride-sensitive sodium channel subunit alpha
Synonyms:
Alpha-ENaC Amiloride-sensitive sodium channel subunit alpha Nonvoltage-gated sodium channel 1 subunit alpha SCNNA_MOUSE | Scnn1a
Type:
PROTEIN
Mol. Mass.:
78903.70
Organism:
Mus musculus
Description:
ChEMBL_109863
Residue:
699
  
Inhibitor
Name:
BDBM50112171
Synonyms:
CHEMBL3608426
Type:
Small organic molecule
Emp. Form.:
C42H55Cl3N12O5
Mol. Mass.:
914.322
SMILES:
Cl.[Cl-].Nc1nc(N)c(nc1Cl)C(=O)N[C@H]1CCC[N+](CCCc2ccc(OCC(=O)NCCn3ccnc3)cc2)(CCCc2ccc(OCC(=O)NCCn3ccnc3)cc2)C1
: