Target
Carbonic anhydrase 9
Ligand
BDBM50114848
Substrate
Meas. Tech.
ChEMBL_1512515 (CHEMBL3610379)
Ki
11±n/a nM
Citation
 Krasavin, MKorsakov, MDorogov, MTuccinardi, TDedeoglu, NSupuran, CT Probing the 'bipolar' nature of the carbonic anhydrase active site: aromatic sulfonamides containing 1,3-oxazol-5-yl moiety as picomolar inhibitors of cytosolic CA I and CA II isoforms. Eur J Med Chem 101:334-47 (2015)  
Target
Name:
Carbonic anhydrase 9
Synonyms:
CA-IX CAH9_HUMAN Carbonic anhydrase 9 (CA IX) Carbonic anhydrase 9 precursor Carbonic anhydrase IX (CAIX) Carbonic anhydrases; II & IX MN RCC-associated antigen G250
Type:
Enzyme
Mol. Mass.:
49669.03
Organism:
Homo sapiens (Human)
Description:
Catalytic domain of human cloned isozyme was used in the assay
Residue:
459
  
Inhibitor
Name:
BDBM50114848
Synonyms:
CHEMBL3608885
Type:
Small organic molecule
Emp. Form.:
C8H8N2O3S2
Mol. Mass.:
244.291
SMILES:
Cc1ncc(o1)-c1ccc(s1)S(N)(=O)=O
: