Target
Carbonic anhydrase 12
Ligand
BDBM50114858
Substrate
Meas. Tech.
ChEMBL_1512516 (CHEMBL3610380)
Ki
8.5±n/a nM
Citation
 Krasavin, MKorsakov, MDorogov, MTuccinardi, TDedeoglu, NSupuran, CT Probing the 'bipolar' nature of the carbonic anhydrase active site: aromatic sulfonamides containing 1,3-oxazol-5-yl moiety as picomolar inhibitors of cytosolic CA I and CA II isoforms. Eur J Med Chem 101:334-47 (2015)  
Target
Name:
Carbonic anhydrase 12
Synonyms:
CA-XII CAH12_HUMAN Carbonic anhydrase Carbonic anhydrase XII Carbonic anhydrase XII (CAXII) | Tumor antigen HOM-RCC-3.1.3
Type:
Enzyme
Mol. Mass.:
39456.00
Organism:
Homo sapiens (Human)
Description:
Catalytic domain of human cloned isozyme was used in the assay
Residue:
354
  
Inhibitor
Name:
BDBM50114858
Synonyms:
CHEMBL3608870
Type:
Small organic molecule
Emp. Form.:
C10H10N2O3S
Mol. Mass.:
238.263
SMILES:
Cc1ncc(o1)-c1ccc(cc1)S(N)(=O)=O
: