Target
Carbonic anhydrase 12
Ligand
BDBM50114862
Substrate
Meas. Tech.
ChEMBL_1512516 (CHEMBL3610380)
Ki
6.9±n/a nM
Citation
 Krasavin, MKorsakov, MDorogov, MTuccinardi, TDedeoglu, NSupuran, CT Probing the 'bipolar' nature of the carbonic anhydrase active site: aromatic sulfonamides containing 1,3-oxazol-5-yl moiety as picomolar inhibitors of cytosolic CA I and CA II isoforms. Eur J Med Chem 101:334-47 (2015)  
Target
Name:
Carbonic anhydrase 12
Synonyms:
CA-XII CAH12_HUMAN Carbonic anhydrase Carbonic anhydrase XII Carbonic anhydrase XII (CAXII) | Tumor antigen HOM-RCC-3.1.3
Type:
Enzyme
Mol. Mass.:
39456.00
Organism:
Homo sapiens (Human)
Description:
Catalytic domain of human cloned isozyme was used in the assay
Residue:
354
  
Inhibitor
Name:
BDBM50114862
Synonyms:
CHEMBL3608874
Type:
Small organic molecule
Emp. Form.:
C14H15N3O5S
Mol. Mass.:
337.351
SMILES:
NS(=O)(=O)c1ccc(cc1)-c1cnc(o1)C(=O)N1CCOCC1
: