Target
Carbonic anhydrase 1
Ligand
BDBM50114869
Substrate
Meas. Tech.
ChEMBL_1512513 (CHEMBL3610377)
Ki
8.5±n/a nM
Citation
 Krasavin, MKorsakov, MDorogov, MTuccinardi, TDedeoglu, NSupuran, CT Probing the 'bipolar' nature of the carbonic anhydrase active site: aromatic sulfonamides containing 1,3-oxazol-5-yl moiety as picomolar inhibitors of cytosolic CA I and CA II isoforms. Eur J Med Chem 101:334-47 (2015)  
Target
Name:
Carbonic anhydrase 1
Synonyms:
CA-I CAB Carbonate dehydratase I Carbonic anhydrase 1 (CA I) Carbonic anhydrase 1 (Recombinant CA I) Carbonic anhydrase B Carbonic anhydrase I (CA I) Carbonic anhydrase I (CAI) Carbonic anhydrase isoenzyme I (hCA I) | hCA
Type:
Enzyme
Mol. Mass.:
28873.37
Organism:
Homo sapiens (Human)
Description:
P00915
Residue:
261
  
Inhibitor
Name:
BDBM50114869
Synonyms:
CHEMBL3608881
Type:
Small organic molecule
Emp. Form.:
C15H17N3O4S
Mol. Mass.:
335.378
SMILES:
Cc1ccc(cc1S(N)(=O)=O)-c1cnc(o1)C(=O)N1CCCC1
: