Target
Carbonic anhydrase 9
Ligand
BDBM50114870
Substrate
Meas. Tech.
ChEMBL_1512515 (CHEMBL3610379)
Ki
3.7±n/a nM
Citation
 Krasavin, MKorsakov, MDorogov, MTuccinardi, TDedeoglu, NSupuran, CT Probing the 'bipolar' nature of the carbonic anhydrase active site: aromatic sulfonamides containing 1,3-oxazol-5-yl moiety as picomolar inhibitors of cytosolic CA I and CA II isoforms. Eur J Med Chem 101:334-47 (2015)  
Target
Name:
Carbonic anhydrase 9
Synonyms:
CA-IX CAH9_HUMAN Carbonic anhydrase 9 (CA IX) Carbonic anhydrase 9 precursor Carbonic anhydrase IX (CAIX) Carbonic anhydrases; II & IX MN RCC-associated antigen G250
Type:
Enzyme
Mol. Mass.:
49669.03
Organism:
Homo sapiens (Human)
Description:
Catalytic domain of human cloned isozyme was used in the assay
Residue:
459
  
Inhibitor
Name:
BDBM50114870
Synonyms:
CHEMBL3608882
Type:
Small organic molecule
Emp. Form.:
C15H17N3O5S
Mol. Mass.:
351.378
SMILES:
Cc1ccc(cc1S(N)(=O)=O)-c1cnc(o1)C(=O)N1CCOCC1
: