Target
Macrophage-stimulating protein receptor
Ligand
BDBM50115201
Substrate
Meas. Tech.
ChEMBL_1513738 (CHEMBL3610848)
IC50
23±n/a nM
Citation
 Raeppel, FRaeppel, SLTherrien, E Design, synthesis and RON receptor tyrosine kinase inhibitory activity of new head groups analogs of LCRF-0004. Bioorg Med Chem Lett 25:3810-5 (2015)  
Target
Name:
Macrophage-stimulating protein receptor
Synonyms:
2.7.10.1 CDw136 MST1R Macrophage-stimulating protein receptor alpha chain PTK8 RON Tyrosine kinase receptor ron | p185-Ron
Type:
Protein
Mol. Mass.:
152270.76
Organism:
Homo sapiens (Human)
Description:
Q04912
Residue:
1400
  
Inhibitor
Name:
BDBM50115201
Synonyms:
CHEMBL3608544
Type:
Small organic molecule
Emp. Form.:
C33H23FN6O2S
Mol. Mass.:
586.638
SMILES:
Cn1cnc(c1)-c1cc2nccc(Oc3ccc(NC(=O)c4cnn(c4-c4ccccc4)-c4ccccc4)cc3F)c2s1
: