Target
Metabotropic glutamate receptor 4
Ligand
BDBM50325108
Substrate
Meas. Tech.
ChEMBL_1512613 (CHEMBL3610660)
EC50
20±n/a nM
Citation
 Zhang, ZKil, KEPoutiainen, PChoi, JKKang, HJHuang, XPRoth, BLBrownell, AL Re-exploring the N-phenylpicolinamide derivatives to develop mGlu4 ligands with improved affinity and in vitro microsomal stability. Bioorg Med Chem Lett 25:3956-60 (2015)  
Target
Name:
Metabotropic glutamate receptor 4
Synonyms:
GPRC1D GRM4_HUMAN MGLUR4 Metabotropic glutamate receptor 4 (mGlu4) metabotropic glutamate 4
Type:
Protein
Mol. Mass.:
101899.95
Organism:
Homo sapiens (Human)
Description:
Q14833
Residue:
912
  
Inhibitor
Name:
BDBM50325108
Synonyms:
CHEMBL1223381 | N-(3-chloro-4-(N-(2-chlorophenyl)sulfamoyl)phenyl)picolinamide
Type:
Small organic molecule
Emp. Form.:
C18H13Cl2N3O3S
Mol. Mass.:
422.285
SMILES:
Clc1ccccc1NS(=O)(=O)c1ccc(NC(=O)c2ccccn2)cc1Cl
: