Target
Carbonic anhydrase 2
Ligand
BDBM75364
Substrate
Meas. Tech.
ChEMBL_1513115 (CHEMBL3610543)
Ki
6.5±n/a nM
Citation
 Congiu, COnnis, VDeplano, ABalboni, GDedeoglu, NSupuran, CT Synthesis of sulfonamides incorporating piperazinyl-ureido moieties and their carbonic anhydrase I, II, IX and XII inhibitory activity. Bioorg Med Chem Lett 25:3850-3 (2015)  
Target
Name:
Carbonic anhydrase 2
Synonyms:
CA-II CAC Carbonate dehydratase II Carbonic anhydrase 2 (CA-II) Carbonic anhydrase C Carbonic anhydrase II (CA-II) Carbonic anhydrase II (hCA II) | Carbonic anhydrase isoenzyme II (hCA II)
Type:
Enzyme
Mol. Mass.:
29250.71
Organism:
Homo sapiens (Human)
Description:
P00918
Residue:
260
  
Inhibitor
Name:
BDBM75364
Synonyms:
4-(phenylmethyl)-N-(4-sulfamoylphenyl)-1-piperazinecarboxamide 4-benzyl-N-(4-sulfamoylphenyl)piperazine-1-carboxamide cid_27869236
Type:
Small organic molecule
Emp. Form.:
C18H22N4O3S
Mol. Mass.:
374.457
SMILES:
NS(=O)(=O)c1ccc(NC(=O)N2CCN(Cc3ccccc3)CC2)cc1
: