Target
Carbonic anhydrase 2
Ligand
BDBM50116588
Substrate
Meas. Tech.
ChEMBL_1513115 (CHEMBL3610543)
Ki
6.8±n/a nM
Citation
 Congiu, COnnis, VDeplano, ABalboni, GDedeoglu, NSupuran, CT Synthesis of sulfonamides incorporating piperazinyl-ureido moieties and their carbonic anhydrase I, II, IX and XII inhibitory activity. Bioorg Med Chem Lett 25:3850-3 (2015)  
Target
Name:
Carbonic anhydrase 2
Synonyms:
CA-II CAC Carbonate dehydratase II Carbonic anhydrase 2 (CA-II) Carbonic anhydrase C Carbonic anhydrase II (CA-II) Carbonic anhydrase II (hCA II) | Carbonic anhydrase isoenzyme II (hCA II)
Type:
Enzyme
Mol. Mass.:
29250.71
Organism:
Homo sapiens (Human)
Description:
P00918
Residue:
260
  
Inhibitor
Name:
BDBM50116588
Synonyms:
CHEMBL3609481
Type:
Small organic molecule
Emp. Form.:
C17H18N6O3S
Mol. Mass.:
386.428
SMILES:
NS(=O)(=O)c1ccc(NC(=O)N2CCN(CC2)c2ncccc2C#N)cc1
: