Target
Insulin receptor
Ligand
BDBM50116680
Substrate
Meas. Tech.
ChEMBL_1513260 (CHEMBL3610968)
IC50
5.1±n/a nM
Citation
 Kang, GALee, MSong, DLee, HKAhn, SPark, CHLee, COYun, CSJung, HKim, PHa, JDCho, SYKim, HRHwang, JY Synthesis and evaluation of novel 2,4-diaminopyrimidines bearing bicyclic aminobenzazepines for anaplastic lymphoma kinase (ALK) inhibitor. Bioorg Med Chem Lett 25:3992-8 (2015)  
Target
Name:
Insulin receptor
Synonyms:
INSR INSR_HUMAN Insulin receptor beta subunit
Type:
Receptor Tyrosine Kinase
Mol. Mass.:
156322.60
Organism:
Homo sapiens (Human)
Description:
P06213
Residue:
1382
  
Inhibitor
Name:
BDBM50116680
Synonyms:
CHEMBL3608523 | US10053458, 56
Type:
Small organic molecule
Emp. Form.:
C24H28ClN5O3S
Mol. Mass.:
502.029
SMILES:
COc1cc2CCCNCc2cc1Nc1ncc(Cl)c(Nc2ccccc2S(=O)(=O)C(C)C)n1
: