Target
Adenosine receptor A1
Ligand
BDBM50117137
Substrate
Meas. Tech.
ChEMBL_1516113 (CHEMBL3615756)
Ki
1.3±n/a nM
Citation
 Louvel, JGuo, DSoethoudt, MMocking, TALenselink, EBMulder-Krieger, THeitman, LHIJzerman, AP Structure-kinetics relationships of Capadenoson derivatives as adenosine A1 receptor agonists. Eur J Med Chem 101:681-91 (2015)  
Target
Name:
Adenosine receptor A1
Synonyms:
A1 adenosine receptor (hA1) AA1R_HUMAN ADORA1 Adenosine A1-receptor Adenosine receptor A1 (hA1) | Adenosine transporter (AdT)
Type:
G Protein-Coupled Receptor (GPCR)
Mol. Mass.:
36520.92
Organism:
Homo sapiens (Human)
Description:
P30542
Residue:
326
  
Inhibitor
Name:
BDBM50117137
Synonyms:
CHEMBL3613124
Type:
Small organic molecule
Emp. Form.:
C18H13N5OS2
Mol. Mass.:
379.459
SMILES:
COc1ccc(cc1)-c1c(C#N)c(N)nc(SCc2cscn2)c1C#N
: