Target
Adenosine receptor A1
Ligand
BDBM50117143
Substrate
Meas. Tech.
ChEMBL_1516113 (CHEMBL3615756)
Ki
1.5±n/a nM
Citation
 Louvel, JGuo, DSoethoudt, MMocking, TALenselink, EBMulder-Krieger, THeitman, LHIJzerman, AP Structure-kinetics relationships of Capadenoson derivatives as adenosine A1 receptor agonists. Eur J Med Chem 101:681-91 (2015)  
Target
Name:
Adenosine receptor A1
Synonyms:
A1 adenosine receptor (hA1) AA1R_HUMAN ADORA1 Adenosine A1-receptor Adenosine receptor A1 (hA1) | Adenosine transporter (AdT)
Type:
G Protein-Coupled Receptor (GPCR)
Mol. Mass.:
36520.92
Organism:
Homo sapiens (Human)
Description:
P30542
Residue:
326
  
Inhibitor
Name:
BDBM50117143
Synonyms:
CHEMBL3613120
Type:
Small organic molecule
Emp. Form.:
C23H14ClN5OS2
Mol. Mass.:
475.973
SMILES:
Nc1nc(SCc2csc(n2)-c2ccc(Cl)cc2)c(C#N)c(-c2ccc(O)cc2)c1C#N
: