Target
Adenosine receptor A1
Ligand
BDBM50117134
Substrate
Meas. Tech.
ChEMBL_1516121 (CHEMBL3615869)
EC50
1.9±n/a nM
Citation
 Louvel, JGuo, DSoethoudt, MMocking, TALenselink, EBMulder-Krieger, THeitman, LHIJzerman, AP Structure-kinetics relationships of Capadenoson derivatives as adenosine A1 receptor agonists. Eur J Med Chem 101:681-91 (2015)  
Target
Name:
Adenosine receptor A1
Synonyms:
A1 adenosine receptor (hA1) AA1R_HUMAN ADORA1 Adenosine A1-receptor Adenosine receptor A1 (hA1) | Adenosine transporter (AdT)
Type:
G Protein-Coupled Receptor (GPCR)
Mol. Mass.:
36520.92
Organism:
Homo sapiens (Human)
Description:
P30542
Residue:
326
  
Inhibitor
Name:
BDBM50117134
Synonyms:
CHEMBL3613126
Type:
Small organic molecule
Emp. Form.:
C22H20N6O2S2
Mol. Mass.:
464.563
SMILES:
COc1ccc(cc1)-c1c(C#N)c(N)nc(SCc2csc(n2)N2CCOCC2)c1C#N
: