Target
Epidermal growth factor receptor
Ligand
BDBM50117656
Substrate
Meas. Tech.
ChEMBL_1515019 (CHEMBL3616083)
IC50
4824±n/a nM
Citation
 Ibrahim, DAAbou El Ella, DAEl-Motwally, AMAly, RM Molecular design and synthesis of certain new quinoline derivatives having potential anticancer activity. Eur J Med Chem 102:115-31 (2015)  
Target
Name:
Epidermal growth factor receptor
Synonyms:
EGF Receptor Substrate EGFR_HUMAN ERBB1 Epidermal Growth Factor Receptor erbB-1 Epidermal growth factor receptor (EGFR) HER1 Proto-oncogene c-ErbB-1 Tyrosine-Protein Kinase ErbB-1
Type:
Receptor Kinase Domain
Mol. Mass.:
134279.59
Organism:
Homo sapiens (Human)
Description:
P00533
Residue:
1210
  
Inhibitor
Name:
BDBM50117656
Synonyms:
CHEMBL3613695
Type:
Small organic molecule
Emp. Form.:
C25H17BrClN3O2
Mol. Mass.:
506.778
SMILES:
NC(=O)c1cnc2ccc(cc2c1Nc1ccc(Br)cc1)C(=O)\C=C\c1ccc(Cl)cc1
: