Target
Alpha-1,3-mannosyl-glycoprotein 2-beta-N-acetylglucosaminyltransferase
Ligand
BDBM50117665
Substrate
Meas. Tech.
ChEMBL_1515028 (CHEMBL3616240)
IC50
14900±n/a nM
Citation
 Huard, KLondregan, ATTesz, GBahnck, KBMagee, TVHepworth, DPolivkova, JCoffey, SBPabst, BAGosset, JRNigam, AKou, KSun, HLee, KHerr, MBoehm, MCarpino, PAGoodwin, BPerreault, CLi, QJorgensen, CCTkalcevic, GTSubashi, TAAhn, K Discovery of Selective Small Molecule Inhibitors of Monoacylglycerol Acyltransferase 3. J Med Chem 58:7164-72 (2015)  
Target
Name:
Alpha-1,3-mannosyl-glycoprotein 2-beta-N-acetylglucosaminyltransferase
Synonyms:
GGNT1 GLYT1 GlcNAc-T I MGAT1 N-glycosyl-oligosaccharide-glycoprotein N-acetylglucosaminyltransferase I
Type:
PROTEIN
Mol. Mass.:
50891.32
Organism:
Homo sapiens (Human)
Description:
ChEMBL_107587
Residue:
445
  
Inhibitor
Name:
BDBM50117665
Synonyms:
CHEMBL3613709
Type:
Small organic molecule
Emp. Form.:
C23H25N5O4S
Mol. Mass.:
467.541
SMILES:
COc1cccc(CC(=O)N2Cc3ccc(cc3C2)S(=O)(=O)Nc2cnn(n2)C2CCC2)c1
: