Target
Phosphatidylcholine:ceramide cholinephosphotransferase 1
Ligand
BDBM50117848
Substrate
Meas. Tech.
ChEMBL_1515874 (CHEMBL3614737)
IC50
14200±n/a nM
Citation
 Li, YLQi, XYJiang, HDeng, XDDong, YPDing, TBZhou, LMen, PChu, YWang, RXJiang, XCYe, DY Discovery, synthesis and biological evaluation of 2-(4-(N-phenethylsulfamoyl)phenoxy)acetamides (SAPAs) as novel sphingomyelin synthase 1 inhibitors. Bioorg Med Chem 23:6173-84 (2015)  
Target
Name:
Phosphatidylcholine:ceramide cholinephosphotransferase 1
Synonyms:
MOB Protein Mob SMS1 Sphingomyelin synthase 1 Transmembrane protein 23
Type:
PROTEIN
Mol. Mass.:
48630.99
Organism:
Homo sapiens (Human)
Description:
ChEMBL_109868
Residue:
413
  
Inhibitor
Name:
BDBM50117848
Synonyms:
CHEMBL3613990
Type:
Small organic molecule
Emp. Form.:
C23H24N2O5S
Mol. Mass.:
440.512
SMILES:
COc1ccccc1NC(=O)COc1ccc(cc1)S(=O)(=O)NCCc1ccccc1
: