Target
Vascular endothelial growth factor receptor 2
Ligand
BDBM50118128
Substrate
Meas. Tech.
ChEMBL_1514471 (CHEMBL3615783)
IC50
107±n/a nM
Citation
 Machado, VAPeixoto, DCosta, RFroufe, HJCalhelha, RCAbreu, RMFerreira, ICSoares, RQueiroz, MJ Synthesis, antiangiogenesis evaluation and molecular docking studies of 1-aryl-3-[(thieno[3,2-b]pyridin-7-ylthio)phenyl]ureas: Discovery of a new substitution pattern for type II VEGFR-2 Tyr kinase inhibitors. Bioorg Med Chem 23:6497-509 (2015)  
Target
Name:
Vascular endothelial growth factor receptor 2
Synonyms:
CD_antigen=CD309 Fetal liver kinase 1 (FLK-1) KDR Protein-tyrosine kinase receptor Flk-1 VEGFR-2 VEGFR2 Vascular Endothelial Growth Factor Receptor Kinase 2 Vascular endothelial growth factor receptor 2 (KDR) Vascular endothelial growth factor receptor 2 (VEGFR2) Vascular endothelial growth factor receptor-2 (VEGFR-2)
Type:
Receptor Tyrosine Kinase
Mol. Mass.:
151510.97
Organism:
Homo sapiens (Human)
Description:
P35968
Residue:
1356
  
Inhibitor
Name:
BDBM50118128
Synonyms:
CHEMBL3612228
Type:
Small organic molecule
Emp. Form.:
C21H17N3O2S2
Mol. Mass.:
407.509
SMILES:
COc1ccc(NC(=O)Nc2cccc(Sc3ccnc4ccsc34)c2)cc1
: