Target
Serine/threonine-protein kinase B-raf
Ligand
BDBM50118420
Substrate
Meas. Tech.
ChEMBL_1514934 (CHEMBL3615800)
IC50
1.000000±n/a nM
Citation
 Lawhorn, BGPhilp, JZhao, YLouer, CHammond, MCheung, MFries, HGraves, APShewchuk, LWang, LCottom, JEQi, HZhao, HTotoritis, RZhang, GSchwartz, BLi, HSweitzer, SHolt, DAGatto, GJKallander, LS Identification of Purines and 7-Deazapurines as Potent and Selective Type I Inhibitors of Troponin I-Interacting Kinase (TNNI3K). J Med Chem 58:7431-48 (2015)  
Target
Name:
Serine/threonine-protein kinase B-raf
Synonyms:
B-RAF B-Raf proto-oncogene serine/threonine-protein kinase BRAF1 RAFB1 v-Raf murine sarcoma viral oncogene homolog B1
Type:
Serine/threonine-protein kinase
Mol. Mass.:
84446.00
Organism:
Homo sapiens (Human)
Description:
P15056
Residue:
766
  
Inhibitor
Name:
BDBM50118420
Synonyms:
CHEMBL3613177
Type:
Small organic molecule
Emp. Form.:
C19H16ClN5O2S
Mol. Mass.:
413.881
SMILES:
CNS(=O)(=O)c1cccc(Nc2ncnc3[nH]cc(-c4cccc(Cl)c4)c23)c1
: