Target
Sodium channel protein type 4 subunit alpha
Ligand
BDBM50118519
Substrate
Meas. Tech.
ChEMBL_1516882 (CHEMBL3618798)
IC50
0.062±n/a nM
Citation
 de Lera Ruiz, MKraus, RL Voltage-Gated Sodium Channels: Structure, Function, Pharmacology, and Clinical Indications. J Med Chem 58:7093-118 (2015)  
Target
Name:
Sodium channel protein type 4 subunit alpha
Synonyms:
SCN4A SkM1 Sodium channel protein skeletal muscle subunit alpha Sodium channel protein type IV alpha subunit Voltage-gated sodium channel subunit alpha Nav1.4 | Voltage-gated sodium channel subunit alpha Nav1.4 (Nav1.4)
Type:
Protein
Mol. Mass.:
208010.01
Organism:
Homo sapiens (Human)
Description:
P35499
Residue:
1836
  
Inhibitor
Name:
BDBM50118519
Synonyms:
CHEMBL3617050
Type:
Small organic molecule
Emp. Form.:
C16H24N8O12S
Mol. Mass.:
552.473
SMILES:
[H][C@@]12C[C@]3(CN4C(=N)N[C@@]([H])(C(=O)N1OC[C@@H]2CO)[C@]1([H])N(COC(=O)NO)C(=N)N[C@]41C3(O)O)OS(O)(=O)=O
: