Target
D(2) dopamine receptor
Ligand
BDBM50119496
Substrate
Meas. Tech.
ChEMBL_1515746 (CHEMBL3614299)
EC50
4365±n/a nM
Citation
 Möller, DSalama, IKling, RCHübner, HGmeiner, P 1,4-Disubstituted aromatic piperazines with high 5-HT2A/D2 selectivity: Quantitative structure-selectivity investigations, docking, synthesis and biological evaluation. Bioorg Med Chem 23:6195-209 (2015)  
Target
Name:
D(2) dopamine receptor
Synonyms:
D(2) dopamine receptor DOPAMINE D2 Long DRD2 Dopamine D2 receptor Dopamine D2 receptor (D2R) Dopamine2-like | d2
Type:
Cell-surface receptors
Mol. Mass.:
50647.10
Organism:
Homo sapiens (Human)
Description:
P14416
Residue:
443
  
Inhibitor
Name:
BDBM50119496
Synonyms:
CHEMBL3613877
Type:
Small organic molecule
Emp. Form.:
C23H25N7O2
Mol. Mass.:
431.4903
SMILES:
COc1ccccc1N1CCN(CCc2cn(nn2)-c2ccn3ncc(C=O)c3c2)CC1
: