Target
Tyrosine-protein kinase ABL1
Ligand
BDBM50119566
Substrate
Meas. Tech.
ChEMBL_1517137 (CHEMBL3619920)
Ki
980±n/a nM
Citation
 Kwarcinski, FESteffey, MEFox, CCSoellner, MB Discovery of Bivalent Kinase Inhibitors via Enzyme-Templated Fragment Elaboration. ACS Med Chem Lett 6:898-901 (2015)  
Target
Name:
Tyrosine-protein kinase ABL1
Synonyms:
ABL ABL1_HUMAN JTK7 Proto-oncogene tyrosine-protein kinase ABL1 Tyrosine-protein kinase ABL V-abl Abelson murine leukemia viral oncogene homolog 1 p150 | tyrosine-protein kinase ABL1 isoform a
Type:
Enzyme
Mol. Mass.:
122897.30
Organism:
Homo sapiens (Human)
Description:
P00519
Residue:
1130
  
Inhibitor
Name:
BDBM50119566
Synonyms:
CHEMBL3617732
Type:
Small organic molecule
Emp. Form.:
C20H23N7O
Mol. Mass.:
377.4429
SMILES:
CCCC(=O)Nc1cccc(Nc2nccc(Nc3cc([nH]n3)C3CC3)n2)c1
: