Target
Tyrosine-protein kinase Yes
Ligand
BDBM50119567
Substrate
Meas. Tech.
ChEMBL_1517135 (CHEMBL3619918)
Ki
800±n/a nM
Citation
 Kwarcinski, FESteffey, MEFox, CCSoellner, MB Discovery of Bivalent Kinase Inhibitors via Enzyme-Templated Fragment Elaboration. ACS Med Chem Lett 6:898-901 (2015)  
Target
Name:
Tyrosine-protein kinase Yes
Synonyms:
Proto-oncogene c-Yes YES YES_HUMAN | p61-yes
Type:
Protein
Mol. Mass.:
60801.54
Organism:
Homo sapiens (Human)
Description:
P07947
Residue:
543
  
Inhibitor
Name:
BDBM50119567
Synonyms:
CHEMBL3617740
Type:
Small organic molecule
Emp. Form.:
C29H34N8O3
Mol. Mass.:
542.6321
SMILES:
C[C@@H](NC(=O)CCCCCC(=O)Nc1cccc(Nc2nccc(Nc3cc([nH]n3)C3CC3)n2)c1)c1ccco1
: