Target
Proto-oncogene tyrosine-protein kinase Src
Ligand
BDBM50119576
Substrate
Meas. Tech.
ChEMBL_1517133 (CHEMBL3619916)
Ki
230±n/a nM
Citation
 Kwarcinski, FESteffey, MEFox, CCSoellner, MB Discovery of Bivalent Kinase Inhibitors via Enzyme-Templated Fragment Elaboration. ACS Med Chem Lett 6:898-901 (2015)  
Target
Name:
Proto-oncogene tyrosine-protein kinase Src
Synonyms:
Calmodulin/Proto-oncogene tyrosine-protein kinase Src Proto-oncogene c-Src SRC SRC_HUMAN V-src sarcoma (Schmidt-Ruppin A-2) viral oncogene homolog (avian) p60-Src | pp60c-src
Type:
Protein
Mol. Mass.:
59838.60
Organism:
Homo sapiens (Human)
Description:
P12931
Residue:
536
  
Inhibitor
Name:
BDBM50119576
Synonyms:
CHEMBL3617736
Type:
Small organic molecule
Emp. Form.:
C29H34N8O3
Mol. Mass.:
542.6321
SMILES:
CC(NC(=O)CCCCCC(=O)Nc1cccc(Nc2nccc(Nc3cc([nH]n3)C3CC3)n2)c1)c1ccco1
: