Target
Proto-oncogene tyrosine-protein kinase Src
Ligand
BDBM50119577
Substrate
Meas. Tech.
ChEMBL_1517133 (CHEMBL3619916)
Ki
480±n/a nM
Citation
 Kwarcinski, FESteffey, MEFox, CCSoellner, MB Discovery of Bivalent Kinase Inhibitors via Enzyme-Templated Fragment Elaboration. ACS Med Chem Lett 6:898-901 (2015)  
Target
Name:
Proto-oncogene tyrosine-protein kinase Src
Synonyms:
Calmodulin/Proto-oncogene tyrosine-protein kinase Src Proto-oncogene c-Src SRC SRC_HUMAN V-src sarcoma (Schmidt-Ruppin A-2) viral oncogene homolog (avian) p60-Src | pp60c-src
Type:
Protein
Mol. Mass.:
59838.60
Organism:
Homo sapiens (Human)
Description:
P12931
Residue:
536
  
Inhibitor
Name:
BDBM50119577
Synonyms:
CHEMBL3617735
Type:
Small organic molecule
Emp. Form.:
C31H36N8O3
Mol. Mass.:
568.6693
SMILES:
O=C(CCCCCC(=O)N1CCCC1c1ccco1)Nc1cccc(Nc2nccc(Nc3cc([nH]n3)C3CC3)n2)c1
: