Target
Sphingosine 1-phosphate receptor 2
Ligand
BDBM50120579
Substrate
Meas. Tech.
ChEMBL_1518045 (CHEMBL3619046)
IC50
13±n/a nM
Citation
 Kusumi, KShinozaki, KYamaura, YHashimoto, AKurata, HNaganawa, AUeda, HOtsuki, KMatsushita, TSekiguchi, TKakuuchi, ASeko, T Discovery of novel S1P2 antagonists. Part 2: Improving the profile of a series of 1,3-bis(aryloxy)benzene derivatives. Bioorg Med Chem Lett 25:4387-92 (2015)  
Target
Name:
Sphingosine 1-phosphate receptor 2
Synonyms:
Edg5 S1pr2 | Sphingosine 1-phosphate receptor 2 (S1P2)
Type:
Protein
Mol. Mass.:
38749.58
Organism:
Rattus norvegicus (Rat)
Description:
P47752
Residue:
352
  
Inhibitor
Name:
BDBM50120579
Synonyms:
CHEMBL3618196
Type:
Small organic molecule
Emp. Form.:
C31H27ClFN3O5
Mol. Mass.:
576.015
SMILES:
NC(=O)c1ccc(Oc2cc(NC(=O)N3CCC(O)(CC3)c3ccc(Cl)cc3)cc(Oc3ccc(F)cc3)c2)cc1
: