Target
Alpha-amylase 1A
Ligand
BDBM50120824
Substrate
Meas. Tech.
ChEMBL_1516310 (CHEMBL3618750)
IC50
300000±n/a nM
Citation
 Al-Asri, JFazekas, ELehoczki, GPerdih, AGörick, CMelzig, MFGyémánt, GWolber, GMortier, J From carbohydrates to drug-like fragments: Rational development of novela-amylase inhibitors. Bioorg Med Chem 23:6725-32 (2015)  
Target
Name:
Alpha-amylase 1A
Synonyms:
1,4-alpha-D-glucan glucanohydrolase 1 AMY1A Alpha-amylase | Salivary alpha-amylase
Type:
Glycosidase
Mol. Mass.:
57770.18
Organism:
Homo sapiens (Human)
Description:
Purchased from Sigma Chemical Co.
Residue:
511
  
Inhibitor
Name:
BDBM50120824
Synonyms:
CHEMBL3618478
Type:
Small organic molecule
Emp. Form.:
C21H25N3O8
Mol. Mass.:
447.4385
SMILES:
COc1cccc(C2NC(C([N+]([O-])=O)C(C)(C)C2[N+]([O-])=O)c2cccc(OC)c2O)c1O
: