Target
Cytochrome P450 11B1, mitochondrial
Ligand
BDBM50428336
Substrate
Meas. Tech.
ChEMBL_1519158 (CHEMBL3624351)
IC50
219±n/a nM
Citation
 Hoyt, SBPetrilli, WLondon, CLiang, GBTata, JHu, QYin, Lvan Koppen, CJHartmann, RWStruthers, MWisniewski, TRen, NBopp, CSok, ACai, TQStribling, SPai, LYMa, XMetzger, JVerras, AMcMasters, DChen, QTung, ETang, WSalituro, GBuist, NClemas, JZhou, GGibson, JMaxwell, CALassman, MMcLaughlin, TCastro-Perez, JSzeto, DForrest, GHajdu, RRosenbach, MXiong, Y Discovery of Triazole CYP11B2 Inhibitors with in Vivo Activity in Rhesus Monkeys. ACS Med Chem Lett 6:861-5 (2015)  
Target
Name:
Cytochrome P450 11B1, mitochondrial
Synonyms:
C11B1_HUMAN CYPXIB1 Cytochrome P450 11B1 Cytochrome P450 11B1, mitochondrial | S11BH
Type:
Enzyme
Mol. Mass.:
57591.44
Organism:
Homo sapiens (Human)
Description:
P15538
Residue:
503
  
Inhibitor
Name:
BDBM50428336
Synonyms:
CHEMBL2331704
Type:
Small organic molecule
Emp. Form.:
C20H22N4O
Mol. Mass.:
334.4149
SMILES:
COC(C)(C)c1cncc(c1)-c1ccc-2c(CCc3nnc(C)n-23)c1
: