Target
Cytochrome P450 11B2, mitochondrial
Ligand
BDBM50428337
Substrate
Meas. Tech.
ChEMBL_1519157 (CHEMBL3624350)
IC50
5±n/a nM
Citation
 Hoyt, SBPetrilli, WLondon, CLiang, GBTata, JHu, QYin, Lvan Koppen, CJHartmann, RWStruthers, MWisniewski, TRen, NBopp, CSok, ACai, TQStribling, SPai, LYMa, XMetzger, JVerras, AMcMasters, DChen, QTung, ETang, WSalituro, GBuist, NClemas, JZhou, GGibson, JMaxwell, CALassman, MMcLaughlin, TCastro-Perez, JSzeto, DForrest, GHajdu, RRosenbach, MXiong, Y Discovery of Triazole CYP11B2 Inhibitors with in Vivo Activity in Rhesus Monkeys. ACS Med Chem Lett 6:861-5 (2015)  
Target
Name:
Cytochrome P450 11B2, mitochondrial
Synonyms:
Aldosterone Synthase (CYP11B2) Aldosterone-synthesizing enzyme CYP11B2 Cytochrome P450 11B2 Cytochrome P450 11B2, mitochondrial P-450C18 | Steroid 18-hydroxylase
Type:
Protein
Mol. Mass.:
57582.15
Organism:
Homo sapiens (Human)
Description:
P19099
Residue:
503
  
Inhibitor
Name:
BDBM50428337
Synonyms:
CHEMBL2331706
Type:
Small organic molecule
Emp. Form.:
C20H16N4
Mol. Mass.:
312.3678
SMILES:
Cc1nnc2CCc3cc(ccc3-n12)-c1cncc2ccccc12
: