Target
B2 bradykinin receptor
Ligand
BDBM50121684
Substrate
Meas. Tech.
ChEMBL_1516520 (CHEMBL3619871)
Ki
0.430000±n/a nM
Citation
 Deekonda, SRankin, DDavis, PLai, JPorreca, FHruby, VJ Design, synthesis and biological evaluation of multifunctional ligands targeting opioid and bradykinin 2 receptors. Bioorg Med Chem Lett 25:4148-52 (2015)  
Target
Name:
B2 bradykinin receptor
Synonyms:
B2 bradykinin receptor BDKRB2 BKRB2_CAVPO | Bradykinin B2 receptor
Type:
Mol. Mass.:
42217.03
Organism:
Cavia porcellus
Description:
Residue:
372
  
Inhibitor
Name:
BDBM50121684
Synonyms:
CHEMBL3616944
Type:
Small organic molecule
Emp. Form.:
C59H89N19O13S
Mol. Mass.:
1304.522
SMILES:
N[C@H](CCCNC(N)=N)C(=O)N[C@@H](CCCNC(N)=N)C(=O)N1CCC[C@H]1C(=O)N1CC(O)CC1C(=O)NCC(=O)NC(Cc1cccs1)C(=O)N[C@@H](CO)C(=O)N1Cc2ccccc2C[C@@H]1C(=O)N1C2CCCCC2CC1C(=O)N[C@@H](CCCNC(N)=N)C(O)=O
: