Target
Polyphenol oxidase 2
Ligand
BDBM50121843
Substrate
Meas. Tech.
ChEMBL_1516668 (CHEMBL3620448)
Ki
7820±n/a nM
Citation
 Radhakrishnan, SShimmon, RConn, CBaker, A Integrated kinetic studies and computational analysis on naphthyl chalcones as mushroom tyrosinase inhibitors. Bioorg Med Chem Lett 25:4085-91 (2015)  
Target
Name:
Polyphenol oxidase 2
Synonyms:
Monophenol monooxygenase PPO2 Tyrosinase
Type:
Protein
Mol. Mass.:
63923.66
Organism:
Agaricus bisporus (Common mushroom)
Description:
O42713
Residue:
556
  
Inhibitor
Name:
BDBM50121843
Synonyms:
CHEMBL3617128
Type:
Small organic molecule
Emp. Form.:
C18H14N2O2
Mol. Mass.:
290.316
SMILES:
O\N=C(/C=C/c1ccncc1)\c1cc2ccccc2cc1O
: