Target
Polyphenol oxidase 2
Ligand
BDBM50121845
Substrate
Meas. Tech.
ChEMBL_1516668 (CHEMBL3620448)
Ki
9400±n/a nM
Citation
 Radhakrishnan, SShimmon, RConn, CBaker, A Integrated kinetic studies and computational analysis on naphthyl chalcones as mushroom tyrosinase inhibitors. Bioorg Med Chem Lett 25:4085-91 (2015)  
Target
Name:
Polyphenol oxidase 2
Synonyms:
Monophenol monooxygenase PPO2 Tyrosinase
Type:
Protein
Mol. Mass.:
63923.66
Organism:
Agaricus bisporus (Common mushroom)
Description:
O42713
Residue:
556
  
Inhibitor
Name:
BDBM50121845
Synonyms:
CHEMBL3617130
Type:
Small organic molecule
Emp. Form.:
C21H19NO4
Mol. Mass.:
349.3799
SMILES:
COc1ccc(OC)c(\C=C\C(=N/O)\c2cc3ccccc3cc2O)c1
: